Reaction Details
TargetRho-associated protein kinase 1
LigandBDBM50358488
Substrate/Competitorn/a
Meas. Tech.ChEMBL_789921 (CHEMBL1925274)
IC50 170±n/a nM
Citation Chowdhury, SSessions, EHPocas, JRGrant, WSchröter, TLin, LRuiz, CCameron, MDSchürer, SLoGrasso, PBannister, TDFeng, Y Discovery and optimization of indoles and 7-azaindoles as Rho kinase (ROCK) inhibitors (part-I). Bioorg Med Chem Lett21:7107-12 (2011) 
 
Rho-associated protein kinase 1
Name:Rho-associated protein kinase 1
Type:Serine/threonine-protein kinase
Mol. Mass.:158156.77
Organism:Homo sapiens (Human)
Description:Q13464
Residue:1354
BDBM50358488
NameBDBM50358488
Synonyms:CHEMBL1923175
TypeSmall organic molecule
Emp. Form.C19H22N4O
Mol. Mass.322.4042
SMILESO=C(NCC1CCCCC1)c1c[nH]c2cc(ccc12)-c1cn[nH]c1