Reaction Details
TargetHistamine H4 receptor
LigandBDBM50358533
Substrate/Competitorn/a
Meas. Tech.ChEMBL_790129 (CHEMBL1926408)
Ki 2900±n/a nM
Citation de Graaf, CKooistra, AJVischer, HFKatritch, VKuijer, MShiroishi, MIwata, SShimamura, TStevens, RCde Esch, IJLeurs, R Crystal structure-based virtual screening for fragment-like ligands of the human histamine H(1) receptor. J Med Chem54:8195-206 (2011) 
 
Histamine H4 receptor
Name:Histamine H4 receptor
Type:G Protein-Coupled Receptor (GPCR)
Mol. Mass.:44517.02
Organism:Homo sapiens (Human)
Description:Binding assays were using CHO cells stably expressing hH4R receptors.
Residue:390
BDBM50358533
NameBDBM50358533
Synonyms:CHEMBL1923522
TypeSmall organic molecule
Emp. Form.C15H23N7
Mol. Mass.301.39
SMILESCN1CCN(CC1)c1nc(N2CCCC2)c2cnn(C)c2n1