Reaction Details
TargetHistamine H1 receptor
LigandBDBM22567
Substrate/Competitorn/a
Meas. Tech.ChEMBL_790127 (CHEMBL1926406)
Ki 2.09±n/a nM
Citation de Graaf, CKooistra, AJVischer, HFKatritch, VKuijer, MShiroishi, MIwata, SShimamura, TStevens, RCde Esch, IJLeurs, R Crystal structure-based virtual screening for fragment-like ligands of the human histamine H(1) receptor. J Med Chem54:8195-206 (2011) 
 
Histamine H1 receptor
Name:Histamine H1 receptor
Type:G Protein-Coupled Receptor (GPCR)
Mol. Mass.:55808.72
Organism:Homo sapiens (Human)
Description:Cell pellets from SK-N-MC cells transfected with human H1 receptor were used in binding assay.
Residue:487
BDBM22567
NameBDBM22567
Synonyms:3H]pyrilamine Dorantamin N-(4-methoxybenzyl)-N ,N -dimethyl-N-pyridin-2-ylethane-1,2-diamine PYRILAMINE [3H]mepyramine | [3H]pyrilamine
Typeradiolabeled ligand
Emp. Form.C17H23N3O
Mol. Mass.285.384
SMILESCOc1ccc(CN(CCN(C)C)c2ccccn2)cc1