Reaction Details
TargetHistamine H3 receptor
LigandBDBM50358574
Substrate/Competitorn/a
Meas. Tech.ChEMBL_790539 (CHEMBL1925992)
Ki 10±n/a nM
Citation Becknell, NCLyons, JAAimone, LDGruner, JAMathiasen, JRRaddatz, RHudkins, RL Synthesis and evaluation of pyridone-phenoxypropyl-R-2-methylpyrrolidine analogues as histamine H3 receptor antagonists. Bioorg Med Chem Lett21:7076-80 (2011) 
 
Histamine H3 receptor
Name:Histamine H3 receptor
Type:G Protein-Coupled Receptor (GPCR)
Mol. Mass.:48607.98
Organism:Rattus norvegicus (rat)
Description:n/a
Residue:445
BDBM50358574
NameBDBM50358574
Synonyms:CHEMBL1923735
TypeSmall organic molecule
Emp. Form.C26H30N2O2
Mol. Mass.402.5286
SMILESC[C@@H]1CCCN1CCCOc1ccc(cc1)-c1ccc(=O)n(Cc2ccccc2)c1