Reaction Details
TargetHistamine H3 receptor
LigandBDBM50358577
Substrate/Competitorn/a
Meas. Tech.ChEMBL_790539 (CHEMBL1925992)
Ki 2.4±n/a nM
Citation Becknell, NCLyons, JAAimone, LDGruner, JAMathiasen, JRRaddatz, RHudkins, RL Synthesis and evaluation of pyridone-phenoxypropyl-R-2-methylpyrrolidine analogues as histamine H3 receptor antagonists. Bioorg Med Chem Lett21:7076-80 (2011) 
 
Histamine H3 receptor
Name:Histamine H3 receptor
Type:G Protein-Coupled Receptor (GPCR)
Mol. Mass.:48607.98
Organism:Rattus norvegicus (rat)
Description:n/a
Residue:445
BDBM50358577
NameBDBM50358577
Synonyms:CHEMBL1923738
TypeSmall organic molecule
Emp. Form.C24H28N2O2
Mol. Mass.376.4913
SMILESC[C@@H]1CCCN1CCCOc1ccc(cc1)-c1cn(C)c(=O)c2ccccc12