Reaction Details
TargetRho-associated protein kinase 2
LigandBDBM50358699
Substrate/Competitorn/a
Meas. Tech.ChEMBL_789445 (CHEMBL1924421)
IC50 200±n/a nM
Citation Sessions, EHChowdhury, SYin, YPocas, JRGrant, WSchröter, TLin, LRuiz, CCameron, MDLoGrasso, PBannister, TDFeng, Y Discovery and optimization of indole and 7-azaindoles as Rho kinase (ROCK) inhibitors (part-II). Bioorg Med Chem Lett21:7113-8 (2011) 
 
Rho-associated protein kinase 2
Name:Rho-associated protein kinase 2
Type:Protein
Mol. Mass.:160885.43
Organism:Homo sapiens (Human)
Description:O75116
Residue:1388
BDBM50358699
NameBDBM50358699
Synonyms:CHEMBL1922030
TypeSmall organic molecule
Emp. Form.C22H22N4O2
Mol. Mass.374.4357
SMILESCOc1cccc(CN(C)C(=O)c2cc3ccc(cc3n2C)-c2cn[nH]c2)c1