Reaction Details
TargetRho-associated protein kinase 2
LigandBDBM50358718
Substrate/Competitorn/a
Meas. Tech.ChEMBL_789445 (CHEMBL1924421)
IC50 62±n/a nM
Citation Sessions, EHChowdhury, SYin, YPocas, JRGrant, WSchröter, TLin, LRuiz, CCameron, MDLoGrasso, PBannister, TDFeng, Y Discovery and optimization of indole and 7-azaindoles as Rho kinase (ROCK) inhibitors (part-II). Bioorg Med Chem Lett21:7113-8 (2011) 
 
Rho-associated protein kinase 2
Name:Rho-associated protein kinase 2
Type:Protein
Mol. Mass.:160885.43
Organism:Homo sapiens (Human)
Description:O75116
Residue:1388
BDBM50358718
NameBDBM50358718
Synonyms:CHEMBL1922135
TypeSmall organic molecule
Emp. Form.C27H33N7O2
Mol. Mass.487.5966
SMILESCOc1cccc(CN(CCCN2CCN(C)CC2)C(=O)c2c[nH]c3nc(ccc23)-c2cn[nH]c2)c1