Reaction Details
TargetRho-associated protein kinase 1
LigandBDBM50358713
Substrate/Competitorn/a
Meas. Tech.ChEMBL_789446 (CHEMBL1924422)
IC50 3±n/a nM
Citation Sessions, EHChowdhury, SYin, YPocas, JRGrant, WSchröter, TLin, LRuiz, CCameron, MDLoGrasso, PBannister, TDFeng, Y Discovery and optimization of indole and 7-azaindoles as Rho kinase (ROCK) inhibitors (part-II). Bioorg Med Chem Lett21:7113-8 (2011) 
 
Rho-associated protein kinase 1
Name:Rho-associated protein kinase 1
Type:Serine/threonine-protein kinase
Mol. Mass.:158156.77
Organism:Homo sapiens (Human)
Description:Q13464
Residue:1354
BDBM50358713
NameBDBM50358713
Synonyms:CHEMBL1922128
TypeSmall organic molecule
Emp. Form.C23H24N4O3
Mol. Mass.404.4617
SMILESCOc1cccc(CNC(=O)c2cn(CCCO)c3cc(ccc23)-c2cn[nH]c2)c1