Reaction Details
TargetSerine/threonine-protein kinase B-raf
LigandBDBM25391
Substrate/Competitorn/a
Meas. Tech.ChEMBL_789760 (CHEMBL1924976)
Kd 0.16±n/a nM
Citation Wang, XSalaski, EJBerger, DMPowell, DHu, YWojciechowicz, DCollins, KFrommer, E Structure-based design of isoindoline-1,3-diones and 2,3-dihydrophthalazine-1,4-diones as novel B-Raf inhibitors. Bioorg Med Chem Lett21:6941-4 (2011) 
 
Serine/threonine-protein kinase B-raf
Name:Serine/threonine-protein kinase B-raf
Type:Serine/threonine-protein kinase
Mol. Mass.:84446.00
Organism:Homo sapiens (Human)
Description:P15056
Residue:766
BDBM25391
NameBDBM25391
Synonyms:CHEMBL200622 SB590885 | [2-(4-{4-[(1E)-1-(hydroxyimino)-2,3-dihydro-1H-inden-5-yl]-5-(pyridin-4-yl)-1H-imidazol-2-yl}phenoxy)ethyl]dimethylamine
TypeSmall organic molecule
Emp. Form.C27H27N5O2
Mol. Mass.453.5356
SMILESCN(C)CCOc1ccc(cc1)-c1nc(c([nH]1)-c1ccc2C(CCc2c1)N=O)-c1ccncc1