Reaction Details
Target5-hydroxytryptamine receptor 6
LigandBDBM50358778
Substrate/Competitorn/a
Meas. Tech.ChEMBL_789778 (CHEMBL1924994)
Ki 0.14±n/a nM
Citation Ivachtchenko, AVGolovina, ESKadieva, MGKysil, VMMitkin, ODTkachenko, SEOkun, IM Synthesis and structure-activity relationship (SAR) of (5,7-disubstituted 3-phenylsulfonyl-pyrazolo[1,5-a]pyrimidin-2-yl)-methylamines as potent serotonin 5-HT(6) receptor (5-HT(6)R) antagonists. J Med Chem54:8161-73 (2011) 
 
5-hydroxytryptamine receptor 6
Name:5-hydroxytryptamine receptor 6
Type:G Protein-Coupled Receptor (GPCR)
Mol. Mass.:46968.43
Organism:Homo sapiens (Human)
Description:P50406
Residue:440
BDBM50358778
NameBDBM50358778
Synonyms:CHEMBL1922616
TypeSmall organic molecule
Emp. Form.C14H14ClN5O2S
Mol. Mass.351.811
SMILESCNc1nn2c(N)c(Cl)c(C)nc2c1S(=O)(=O)c1ccccc1