Reaction Details
TargetMetabotropic glutamate receptor 4
LigandBDBM50358779
Substrate/Competitorn/a
Meas. Tech.ChEMBL_790179 (CHEMBL1925519)
IC50>10000±n/a nM
Citation Utley, THaddenham, DSalovich, JMZamorano, RVinson, PNLindsley, CWHopkins, CRNiswender, CM Synthesis and SAR of a novel metabotropic glutamate receptor 4 (mGlu4) antagonist: unexpected 'molecular switch' from a closely related mGlu4 positive allosteric modulator. Bioorg Med Chem Lett21:6955-9 (2011) 
 
Metabotropic glutamate receptor 4
Name:Metabotropic glutamate receptor 4
Type:Protein
Mol. Mass.:101899.95
Organism:Homo sapiens (Human)
Description:Q14833
Residue:912
BDBM50358779
NameBDBM50358779
Synonyms:CHEMBL1922759
TypeSmall organic molecule
Emp. Form.C19H14ClNO2
Mol. Mass.323.773
SMILESClc1ccc(cn1)C(=O)COc1ccccc1-c1ccccc1