Reaction Details
TargetMuscarinic acetylcholine receptor M4
LigandBDBM50358783
Substrate/Competitorn/a
Meas. Tech.ChEMBL_790181 (CHEMBL1925521)
IC50>30000±n/a nM
Citation Utley, THaddenham, DSalovich, JMZamorano, RVinson, PNLindsley, CWHopkins, CRNiswender, CM Synthesis and SAR of a novel metabotropic glutamate receptor 4 (mGlu4) antagonist: unexpected 'molecular switch' from a closely related mGlu4 positive allosteric modulator. Bioorg Med Chem Lett21:6955-9 (2011) 
 
Muscarinic acetylcholine receptor M4
Name:Muscarinic acetylcholine receptor M4
Type:Enzyme Catalytic Domain
Mol. Mass.:53079.31
Organism:Homo sapiens (Human)
Description:Cholinergic, muscarinic M4 CHRM4 HUMAN M3::P08173
Residue:479
BDBM50358783
NameBDBM50358783
Synonyms:CHEMBL1346011
TypeSmall organic molecule
Emp. Form.C14H11BrO4
Mol. Mass.323.139
SMILESOc1ccc(C(=O)COc2ccccc2Br)c(O)c1