Reaction Details
TargetMetabotropic glutamate receptor 4
LigandBDBM50358783
Substrate/Competitorn/a
Meas. Tech.ChEMBL_790183 (CHEMBL1925523)
EC50 1100±n/a nM
Citation Utley, THaddenham, DSalovich, JMZamorano, RVinson, PNLindsley, CWHopkins, CRNiswender, CM Synthesis and SAR of a novel metabotropic glutamate receptor 4 (mGlu4) antagonist: unexpected 'molecular switch' from a closely related mGlu4 positive allosteric modulator. Bioorg Med Chem Lett21:6955-9 (2011) 
 
Metabotropic glutamate receptor 4
Name:Metabotropic glutamate receptor 4
Type:Enzyme
Mol. Mass.:101849.79
Organism:Rattus norvegicus (Rat)
Description:P31423
Residue:912
BDBM50358783
NameBDBM50358783
Synonyms:CHEMBL1346011
TypeSmall organic molecule
Emp. Form.C14H11BrO4
Mol. Mass.323.139
SMILESOc1ccc(C(=O)COc2ccccc2Br)c(O)c1