Reaction Details
TargetMetabotropic glutamate receptor 4
LigandBDBM50358783
Substrate/Competitorn/a
Meas. Tech.ChEMBL_790177 (CHEMBL1925517)
EC50 1400±n/a nM
Citation Utley, THaddenham, DSalovich, JMZamorano, RVinson, PNLindsley, CWHopkins, CRNiswender, CM Synthesis and SAR of a novel metabotropic glutamate receptor 4 (mGlu4) antagonist: unexpected 'molecular switch' from a closely related mGlu4 positive allosteric modulator. Bioorg Med Chem Lett21:6955-9 (2011) 
 
Metabotropic glutamate receptor 4
Name:Metabotropic glutamate receptor 4
Type:Protein
Mol. Mass.:101899.95
Organism:Homo sapiens (Human)
Description:Q14833
Residue:912
BDBM50358783
NameBDBM50358783
Synonyms:CHEMBL1346011
TypeSmall organic molecule
Emp. Form.C14H11BrO4
Mol. Mass.323.139
SMILESOc1ccc(C(=O)COc2ccccc2Br)c(O)c1