Reaction Details
TargetCoagulation factor X
LigandBDBM50328724
Substrate/Competitorn/a
Meas. Tech.ChEMBL_790745 (CHEMBL1926198)
IC50 7±n/a nM
Citation Shi, YO'Connor, SPSitkoff, DZhang, JShi, MBisaha, SNWang, YLi, CRuan, ZLawrence, RMKlei, HEKish, KLiu, ECSeiler, SMSchweizer, LSteinbacher, TESchumacher, WARobl, JAMacor, JEAtwal, KSStein, PD Arylsulfonamidopiperidone derivatives as a novel class of factor Xa inhibitors. Bioorg Med Chem Lett21:7516-21 (2011) 
 
Coagulation factor X
Name:Coagulation factor X
Type:Enzyme
Mol. Mass.:54726.60
Organism:Homo sapiens (Human)
Description:n/a
Residue:488
BDBM50328724
NameBDBM50328724
Synonyms:(S)-N2,N2-dimethyl-N5-((2-methylbenzofuran-5-ylamino)(2-oxo-1-(2-oxo-2-(pyrrolidin-1-yl)ethyl)azepan-3-ylamino)methylene)pyridine-2,5-dicarboxamide CHEMBL570867
TypeSmall organic molecule
Emp. Form.C31H37N7O5
Mol. Mass.587.6694
SMILESCN(C)C(=O)c1ccc(cn1)C(=O)NC(Nc1ccc2oc(C)cc2c1)=N[C@H]1CCCCN(CC(=O)N2CCCC2)C1=O