Reaction Details
TargetTissue-type plasminogen activator
LigandBDBM50358883
Substrate/Competitorn/a
Meas. Tech.ChEMBL_790755 (CHEMBL1926208)
Ki 1279±n/a nM
Citation Shi, YO'Connor, SPSitkoff, DZhang, JShi, MBisaha, SNWang, YLi, CRuan, ZLawrence, RMKlei, HEKish, KLiu, ECSeiler, SMSchweizer, LSteinbacher, TESchumacher, WARobl, JAMacor, JEAtwal, KSStein, PD Arylsulfonamidopiperidone derivatives as a novel class of factor Xa inhibitors. Bioorg Med Chem Lett21:7516-21 (2011) 
 
Tissue-type plasminogen activator
Name:Tissue-type plasminogen activator
Type:Enzyme
Mol. Mass.:62931.08
Organism:Homo sapiens (Human)
Description:n/a
Residue:562
BDBM50358883
NameBDBM50358883
Synonyms:CHEMBL1923468
TypeSmall organic molecule
Emp. Form.C28H29ClN4O5S
Mol. Mass.569.072
SMILESClc1ccc2cc(ccc2c1)S(=O)(=O)N[C@H]1CCCN(CC(=O)N2C[C@@H]3C[C@H](C2)c2cccc(=O)n2C3)C1=O