Reaction Details
TargetTyrosine-protein kinase JAK2
LigandBDBM50358894
Substrate/Competitorn/a
Meas. Tech.ChEMBL_790799 (CHEMBL1926252)
IC50 0.5±n/a nM
Citation Weinberg, LRAlbom, MSAngeles, TSBreslin, HJGingrich, DEHuang, ZLisko, JGMason, JLMilkiewicz, KLThieu, TVUnderiner, TLWells, GJWells-Knecht, KJDorsey, BD 2,7-Pyrrolo[2,1-f][1,2,4]triazines as JAK2 inhibitors: modification of target structure to minimize reactive metabolite formation. Bioorg Med Chem Lett21:7325-30 (2011) 
 
Tyrosine-protein kinase JAK2
Name:Tyrosine-protein kinase JAK2
Type:Protein
Mol. Mass.:130684.68
Organism:Homo sapiens (Human)
Description:O60674
Residue:1132
BDBM50358894
NameBDBM50358894
Synonyms:CHEMBL1923570
TypeSmall organic molecule
Emp. Form.C20H18N4O2
Mol. Mass.346.3825
SMILESCOc1ccc(Nc2ncc3ccc(-c4ccccc4OC)n3n2)cc1