Reaction Details
TargetTyrosine-protein kinase JAK2
LigandBDBM50353052
Substrate/Competitorn/a
Meas. Tech.ChEMBL_790799 (CHEMBL1926252)
IC50 0.190±n/a nM
Citation Weinberg, LRAlbom, MSAngeles, TSBreslin, HJGingrich, DEHuang, ZLisko, JGMason, JLMilkiewicz, KLThieu, TVUnderiner, TLWells, GJWells-Knecht, KJDorsey, BD 2,7-Pyrrolo[2,1-f][1,2,4]triazines as JAK2 inhibitors: modification of target structure to minimize reactive metabolite formation. Bioorg Med Chem Lett21:7325-30 (2011) 
 
Tyrosine-protein kinase JAK2
Name:Tyrosine-protein kinase JAK2
Type:Protein
Mol. Mass.:130684.68
Organism:Homo sapiens (Human)
Description:O60674
Residue:1132
BDBM50353052
NameBDBM50353052
Synonyms:CHEMBL1822515
TypeSmall organic molecule
Emp. Form.C24H26N6O
Mol. Mass.414.5028
SMILESCOc1ccccc1-c1ccc2cnc(Nc3ccc(cc3)N3CCN(C)CC3)nn12