Reaction Details
TargetCarbonic anhydrase 9
LigandBDBM50358924
Substrate/Competitorn/a
Meas. Tech.ChEMBL_790820 (CHEMBL1926273)
Ki 5±n/a nM
Citation Gitto, RDamiano, FMDe Luca, LFerro, SVullo, DSupuran, CTChimirri, A Synthesis and biological profile of new 1,2,3,4-tetrahydroisoquinolines as selective carbonic anhydrase inhibitors. Bioorg Med Chem19:7003-7 (2011) 
 
Carbonic anhydrase 9
Name:Carbonic anhydrase 9
Type:Enzyme
Mol. Mass.:49669.03
Organism:Homo sapiens (Human)
Description:Catalytic domain of human cloned isozyme was used in the assay
Residue:459
BDBM50358924
NameBDBM50358924
Synonyms:CHEMBL1923681
TypeSmall organic molecule
Emp. Form.C16H17N3O5S
Mol. Mass.363.388
SMILESCOc1ccc2C(N(CCc2c1)S(N)(=O)=O)c1ccc(cc1)[N+]([O-])=O