Reaction Details
TargetBeta-secretase 1
LigandBDBM50358938
Substrate/Competitorn/a
Meas. Tech.ChEMBL_790908 (CHEMBL1926456)
Ki 2389±n/a nM
Citation Al-Tel, THSemreen, MHAl-Qawasmeh, RASchmidt, MFEl-Awadi, RArdah, MZaarour, RRao, SNEl-Agnaf, O Design, synthesis, and qualitative structure-activity evaluations of novelß-secretase inhibitors as potential Alzheimer's drug leads. J Med Chem54:8373-85 (2011) 
 
Beta-secretase 1
Name:Beta-secretase 1
Type:Protein
Mol. Mass.:55755.10
Organism:Homo sapiens (Human)
Description:P56817
Residue:501
BDBM50358938
NameBDBM50358938
Synonyms:CHEMBL1923707
TypeSmall organic molecule
Emp. Form.C24H22FN5
Mol. Mass.399.4634
SMILESCC(C)(C)Nc1c(nc2ccccn12)-c1ccc(cc1)-c1nc2ccc(F)cc2[nH]1