Reaction Details
TargetBeta-secretase 1
LigandBDBM50358928
Substrate/Competitorn/a
Meas. Tech.ChEMBL_790908 (CHEMBL1926456)
Ki 34±n/a nM
Citation Al-Tel, THSemreen, MHAl-Qawasmeh, RASchmidt, MFEl-Awadi, RArdah, MZaarour, RRao, SNEl-Agnaf, O Design, synthesis, and qualitative structure-activity evaluations of novelß-secretase inhibitors as potential Alzheimer's drug leads. J Med Chem54:8373-85 (2011) 
 
Beta-secretase 1
Name:Beta-secretase 1
Type:Protein
Mol. Mass.:55755.10
Organism:Homo sapiens (Human)
Description:P56817
Residue:501
BDBM50358928
NameBDBM50358928
Synonyms:CHEMBL1923752
TypeSmall organic molecule
Emp. Form.C20H13FN4
Mol. Mass.328.3424
SMILESFc1ccc2nc([nH]c2c1)-c1cccc(c1)-c1cn2ccccc2n1