Reaction Details
TargetCannabinoid receptor 1
LigandBDBM50358957
Substrate/Competitorn/a
Meas. Tech.ChEMBL_790914 (CHEMBL1926462)
Ki 170±n/a nM
Citation Brizzi, ACascio, MGFrosini, MLigresti, AAiello, FBiotti, IBrizzi, VPertwee, RGCorelli, FDi Marzo, V Resorcinol-sn-glycerol derivatives: novel 2-arachidonoylglycerol mimetics endowed with high affinity and selectivity for cannabinoid type 1 receptor. J Med Chem54:8278-88 (2011) 
 
Cannabinoid receptor 1
Name:Cannabinoid receptor 1
Type:G Protein-Coupled Receptor (GPCR)
Mol. Mass.:52868.96
Organism:Homo sapiens (Human)
Description:P21554
Residue:472
BDBM50358957
NameBDBM50358957
Synonyms:CHEMBL1923771
TypeSmall organic molecule
Emp. Form.C24H42O5
Mol. Mass.410.5873
SMILESCCCCCCC(C)(C)c1cc(O)cc(OCCCCCCOC(CO)CO)c1