Reaction Details
TargetCannabinoid receptor 2
LigandBDBM50358965
Substrate/Competitorn/a
Meas. Tech.ChEMBL_790915 (CHEMBL1926463)
Ki 7870±n/a nM
Citation Brizzi, ACascio, MGFrosini, MLigresti, AAiello, FBiotti, IBrizzi, VPertwee, RGCorelli, FDi Marzo, V Resorcinol-sn-glycerol derivatives: novel 2-arachidonoylglycerol mimetics endowed with high affinity and selectivity for cannabinoid type 1 receptor. J Med Chem54:8278-88 (2011) 
 
Cannabinoid receptor 2
Name:Cannabinoid receptor 2
Type:G Protein-Coupled Receptor (GPCR)
Mol. Mass.:39690.94
Organism:Homo sapiens (Human)
Description:P34972
Residue:360
BDBM50358965
NameBDBM50358965
Synonyms:CHEMBL1923756
TypeSmall organic molecule
Emp. Form.C22H36O6
Mol. Mass.396.5176
SMILESCCCCCc1cc(O)cc(OCCCCCCCC(=O)OC(CO)CO)c1