Reaction Details
TargetCannabinoid receptor 2
LigandBDBM50358951
Substrate/Competitorn/a
Meas. Tech.ChEMBL_790915 (CHEMBL1926463)
Ki 910±n/a nM
Citation Brizzi, ACascio, MGFrosini, MLigresti, AAiello, FBiotti, IBrizzi, VPertwee, RGCorelli, FDi Marzo, V Resorcinol-sn-glycerol derivatives: novel 2-arachidonoylglycerol mimetics endowed with high affinity and selectivity for cannabinoid type 1 receptor. J Med Chem54:8278-88 (2011) 
 
Cannabinoid receptor 2
Name:Cannabinoid receptor 2
Type:G Protein-Coupled Receptor (GPCR)
Mol. Mass.:39690.94
Organism:Homo sapiens (Human)
Description:P34972
Residue:360
BDBM50358951
NameBDBM50358951
Synonyms:CHEMBL1923765
TypeSmall organic molecule
Emp. Form.C20H34O5
Mol. Mass.354.481
SMILESCCCCCc1cc(O)cc(OCCCCCCOC(CO)CO)c1