Reaction Details
TargetAndrogen receptor
LigandBDBM50359007
Substrate/Competitorn/a
Meas. Tech.ChEMBL_791031 (CHEMBL1925692)
IC50>50000±n/a nM
Citation Lack, NAAxerio-Cilies, PTavassoli, PHan, FQChan, KHFeau, CLeBlanc, EGuns, ETGuy, RKRennie, PSCherkasov, A Targeting the binding function 3 (BF3) site of the human androgen receptor through virtual screening. J Med Chem54:8563-73 (2011) 
 
Androgen receptor
Name:Androgen receptor
Type:Receptor
Mol. Mass.:99185.27
Organism:Homo sapiens (Human)
Description:CHO cells were stably transfected with human AR gene.
Residue:920
BDBM50359007
NameBDBM50359007
Synonyms:CHEMBL1924000
TypeSmall organic molecule
Emp. Form.C22H21NO3
Mol. Mass.347.407
SMILESCOC(=O)c1ccc(cc1)[C@H]1Nc2ccc(cc2[C@H]2C=CC[C@@H]12)C(C)=O