Reaction Details
TargetAndrogen receptor
LigandBDBM50359009
Substrate/Competitorn/a
Meas. Tech.ChEMBL_791031 (CHEMBL1925692)
IC50>50000±n/a nM
Citation Lack, NAAxerio-Cilies, PTavassoli, PHan, FQChan, KHFeau, CLeBlanc, EGuns, ETGuy, RKRennie, PSCherkasov, A Targeting the binding function 3 (BF3) site of the human androgen receptor through virtual screening. J Med Chem54:8563-73 (2011) 
 
Androgen receptor
Name:Androgen receptor
Type:Receptor
Mol. Mass.:99185.27
Organism:Homo sapiens (Human)
Description:CHO cells were stably transfected with human AR gene.
Residue:920
BDBM50359009
NameBDBM50359009
Synonyms:CHEMBL1924002
TypeSmall organic molecule
Emp. Form.C18H17BrN2O2S
Mol. Mass.405.309
SMILESNS(=O)(=O)c1ccc2N[C@@H]([C@H]3CC=C[C@H]3c2c1)c1ccc(Br)cc1