Reaction Details
TargetC-C chemokine receptor type 2
LigandBDBM50359021
Substrate/Competitorn/a
Meas. Tech.ChEMBL_791034 (CHEMBL1925695)
Ki 25±n/a nM
Citation Wang, GZHaile, PADaniel, TBelot, BViet, AQGoodman, KBSha, DDowdell, SEVarga, NHong, XChakravorty, SWebb, CCornejo, COlzinski, ABernard, REvans, CEmmons, ABriand, JChung, CWQuek, RLee, DGough, PJSehon, CA CCR2 receptor antagonists: optimization of biaryl sulfonamides to increase activity in whole blood. Bioorg Med Chem Lett21:7291-4 (2011) 
 
C-C chemokine receptor type 2
Name:C-C chemokine receptor type 2
Type:Enzyme
Mol. Mass.:41932.32
Organism:Homo sapiens (Human)
Description:P41597
Residue:374
BDBM50359021
NameBDBM50359021
Synonyms:CHEMBL1924022
TypeSmall organic molecule
Emp. Form.C28H28Cl2F3N3O5S
Mol. Mass.646.505
SMILESCOc1cc(ccc1Oc1ccc(Cl)cc1NS(=O)(=O)c1ccc(Cl)c(c1)C(F)(F)F)C(=O)NCCN1CCCCC1