Reaction Details
TargetC-C chemokine receptor type 2
LigandBDBM50359025
Substrate/Competitorn/a
Meas. Tech.ChEMBL_791034 (CHEMBL1925695)
Ki 13±n/a nM
Citation Wang, GZHaile, PADaniel, TBelot, BViet, AQGoodman, KBSha, DDowdell, SEVarga, NHong, XChakravorty, SWebb, CCornejo, COlzinski, ABernard, REvans, CEmmons, ABriand, JChung, CWQuek, RLee, DGough, PJSehon, CA CCR2 receptor antagonists: optimization of biaryl sulfonamides to increase activity in whole blood. Bioorg Med Chem Lett21:7291-4 (2011) 
 
C-C chemokine receptor type 2
Name:C-C chemokine receptor type 2
Type:Enzyme
Mol. Mass.:41932.32
Organism:Homo sapiens (Human)
Description:P41597
Residue:374
BDBM50359025
NameBDBM50359025
Synonyms:CHEMBL1924005
TypeSmall organic molecule
Emp. Form.C24H23Cl3N4O4S
Mol. Mass.569.888
SMILESClc1cnc(Oc2ccc(cc2)C(=O)NCCN2CCCC2)c(NS(=O)(=O)c2ccc(Cl)c(Cl)c2)c1