Reaction Details
TargetC-C chemokine receptor type 2
LigandBDBM50359027
Substrate/Competitorn/a
Meas. Tech.ChEMBL_791034 (CHEMBL1925695)
Ki 79±n/a nM
Citation Wang, GZHaile, PADaniel, TBelot, BViet, AQGoodman, KBSha, DDowdell, SEVarga, NHong, XChakravorty, SWebb, CCornejo, COlzinski, ABernard, REvans, CEmmons, ABriand, JChung, CWQuek, RLee, DGough, PJSehon, CA CCR2 receptor antagonists: optimization of biaryl sulfonamides to increase activity in whole blood. Bioorg Med Chem Lett21:7291-4 (2011) 
 
C-C chemokine receptor type 2
Name:C-C chemokine receptor type 2
Type:Enzyme
Mol. Mass.:41932.32
Organism:Homo sapiens (Human)
Description:P41597
Residue:374
BDBM50359027
NameBDBM50359027
Synonyms:CHEMBL1924007
TypeSmall organic molecule
Emp. Form.C25H25Cl3N4O4S
Mol. Mass.583.914
SMILESClc1cnc(Oc2cccc(c2)C(=O)NCCN2CCCCC2)c(NS(=O)(=O)c2ccc(Cl)c(Cl)c2)c1