Reaction Details
TargetEstrogen receptor
LigandBDBM50157160
Substrate/Competitorn/a
Meas. Tech.ChEMBL_789796 (CHEMBL1925012)
IC50 0.4±n/a nM
Citation Zhuang, SZhang, JZhang, FZhang, ZWen, YLiu, W Investigation of the diastereomerism of dihydrobenzoxathiin SERMs for ER alpha by molecular modeling. Bioorg Med Chem Lett21:7298-305 (2011) 
 
Estrogen receptor
Name:Estrogen receptor
Type:Protein
Mol. Mass.:66230.44
Organism:Homo sapiens (Human)
Description:P03372
Residue:595
BDBM50157160
NameBDBM50157160
Synonyms:(2S,3R)-2-(4-{2-[(3S,4S)-3,4-DIMETHYLPYRROLIDIN-1-YL]ETHOXY}PHENYL)-3-(4-HYDROXYPHENYL)-2,3-DIHYDRO-1,4-BENZOXATHIIN-6-OL CHEMBL183467
TypeSmall organic molecule
Emp. Form.C28H31NO4S
Mol. Mass.477.615
SMILESC[C@@H]1CN(CCOc2ccc(cc2)[C@@H]2Oc3ccc(O)cc3S[C@@H]2c2ccc(O)cc2)C[C@H]1C