Reaction Details
TargetPotassium voltage-gated channel subfamily H member 2
LigandBDBM50359170
Substrate/Competitorn/a
Meas. Tech.ChEMBL_789985 (CHEMBL1924167)
Ki 19000±n/a nM
Citation Chen, AAspiotis, RCampeau, LCCauchon, EChefson, ADucharme, YFalgueyret, JPGagné, SHan, YHoule, RLaliberté, SLarouche, GLévesque, JFMcKay, DPercival, D Renin inhibitors for the treatment of hypertension: design and optimization of a novel series of spirocyclic piperidines. Bioorg Med Chem Lett21:7399-404 (2011) 
 
Potassium voltage-gated channel subfamily H member 2
Name:Potassium voltage-gated channel subfamily H member 2
Type:Multi-pass membrane protein
Mol. Mass.:126672.65
Organism:Homo sapiens (Human)
Description:Q12809
Residue:1159
BDBM50359170
NameBDBM50359170
Synonyms:CHEMBL1923107
TypeSmall organic molecule
Emp. Form.C30H38N2O6
Mol. Mass.522.6325
SMILESCOCCCc1cc(CN(C2CC2)C(=O)[C@H]2CNCC[C@@]22OC(=O)c3ccccc23)cc(OCCOC)c1