Reaction Details
TargetPotassium voltage-gated channel subfamily H member 2
LigandBDBM50359185
Substrate/Competitorn/a
Meas. Tech.ChEMBL_789985 (CHEMBL1924167)
Ki 7600±n/a nM
Citation Chen, AAspiotis, RCampeau, LCCauchon, EChefson, ADucharme, YFalgueyret, JPGagné, SHan, YHoule, RLaliberté, SLarouche, GLévesque, JFMcKay, DPercival, D Renin inhibitors for the treatment of hypertension: design and optimization of a novel series of spirocyclic piperidines. Bioorg Med Chem Lett21:7399-404 (2011) 
 
Potassium voltage-gated channel subfamily H member 2
Name:Potassium voltage-gated channel subfamily H member 2
Type:Multi-pass membrane protein
Mol. Mass.:126672.65
Organism:Homo sapiens (Human)
Description:Q12809
Residue:1159
BDBM50359185
NameBDBM50359185
Synonyms:CHEMBL1923122
TypeSmall organic molecule
Emp. Form.C31H34F2N2O3
Mol. Mass.520.6101
SMILESCOCCCc1cccc2cccc(CN(C3CC3)C(=O)[C@H]3CNCC[C@@]33OCc4cc(F)c(F)cc34)c12