Reaction Details
TargetCytochrome P450 3A4
LigandBDBM50359182
Substrate/Competitorn/a
Meas. Tech.ChEMBL_789986 (CHEMBL1924168)
IC50 3500±n/a nM
Citation Chen, AAspiotis, RCampeau, LCCauchon, EChefson, ADucharme, YFalgueyret, JPGagné, SHan, YHoule, RLaliberté, SLarouche, GLévesque, JFMcKay, DPercival, D Renin inhibitors for the treatment of hypertension: design and optimization of a novel series of spirocyclic piperidines. Bioorg Med Chem Lett21:7399-404 (2011) 
 
Cytochrome P450 3A4
Name:Cytochrome P450 3A4
Type:Enzyme
Mol. Mass.:57349.57
Organism:Homo sapiens (Human)
Description:n/a
Residue:503
BDBM50359182
NameBDBM50359182
Synonyms:CHEMBL1923119
TypeSmall organic molecule
Emp. Form.C29H36F2N2O3
Mol. Mass.498.6045
SMILESCOCCCc1cc(C)c(C)c(CN(C2CC2)C(=O)[C@H]2CNCC[C@@]22OCc3cc(F)c(F)cc23)c1