Reaction Details
TargetRenin
LigandBDBM50359176
Substrate/Competitorn/a
Meas. Tech.ChEMBL_789821 (CHEMBL1925082)
pH7.4±n/a
IC50 0.2±n/a nM
Commentsextracted
Citation Chen, AAspiotis, RCampeau, LCCauchon, EChefson, ADucharme, YFalgueyret, JPGagné, SHan, YHoule, RLaliberté, SLarouche, GLévesque, JFMcKay, DPercival, D Renin inhibitors for the treatment of hypertension: design and optimization of a novel series of spirocyclic piperidines. Bioorg Med Chem Lett21:7399-404 (2011) 
 
Renin
Name:Renin
Type:Enzyme
Mol. Mass.:45058.99
Organism:Homo sapiens (Human)
Description:n/a
Residue:406
BDBM50359176
NameBDBM50359176
Synonyms:CHEMBL1923113
TypeSmall organic molecule
Emp. Form.C23H22Cl2F2N2O2
Mol. Mass.467.336
SMILESFc1cc2CO[C@@]3(CCNC[C@@H]3C(=O)N(Cc3cccc(Cl)c3Cl)C3CC3)c2cc1F