Reaction Details
TargetRenin
LigandBDBM50359195
Substrate/Competitorn/a
Meas. Tech.ChEMBL_789821 (CHEMBL1925082)
pH7.4±n/a
IC50 0.5±n/a nM
Commentsextracted
Citation Chen, AAspiotis, RCampeau, LCCauchon, EChefson, ADucharme, YFalgueyret, JPGagné, SHan, YHoule, RLaliberté, SLarouche, GLévesque, JFMcKay, DPercival, D Renin inhibitors for the treatment of hypertension: design and optimization of a novel series of spirocyclic piperidines. Bioorg Med Chem Lett21:7399-404 (2011) 
 
Renin
Name:Renin
Type:Enzyme
Mol. Mass.:45058.99
Organism:Homo sapiens (Human)
Description:n/a
Residue:406
BDBM50359195
NameBDBM50359195
Synonyms:CHEMBL1923132
TypeSmall organic molecule
Emp. Form.C34H42ClF2N3O5
Mol. Mass.646.164
SMILESCOCCCc1cc(CCC(=O)N2CCOCC2)c(Cl)c(CN(C2CC2)C(=O)[C@H]2CNCC[C@@]22OCc3cc(F)c(F)cc23)c1