Reaction Details
TargetRenin
LigandBDBM50359177
Substrate/Competitorn/a
Meas. Tech.ChEMBL_789822 (CHEMBL1925083)
IC50 39±n/a nM
Citation Chen, AAspiotis, RCampeau, LCCauchon, EChefson, ADucharme, YFalgueyret, JPGagné, SHan, YHoule, RLaliberté, SLarouche, GLévesque, JFMcKay, DPercival, D Renin inhibitors for the treatment of hypertension: design and optimization of a novel series of spirocyclic piperidines. Bioorg Med Chem Lett21:7399-404 (2011) 
 
Renin
Name:Renin
Type:Enzyme
Mol. Mass.:45058.99
Organism:Homo sapiens (Human)
Description:n/a
Residue:406
BDBM50359177
NameBDBM50359177
Synonyms:CHEMBL1923114
TypeSmall organic molecule
Emp. Form.C23H22Cl2F2N2O2
Mol. Mass.467.336
SMILESFc1cc2CO[C@@]3(CCNC[C@@H]3C(=O)N(Cc3ccc(Cl)cc3Cl)C3CC3)c2cc1F