Reaction Details
TargetRenin
LigandBDBM50359185
Substrate/Competitorn/a
Meas. Tech.ChEMBL_789822 (CHEMBL1925083)
IC50 0.5±n/a nM
Citation Chen, AAspiotis, RCampeau, LCCauchon, EChefson, ADucharme, YFalgueyret, JPGagné, SHan, YHoule, RLaliberté, SLarouche, GLévesque, JFMcKay, DPercival, D Renin inhibitors for the treatment of hypertension: design and optimization of a novel series of spirocyclic piperidines. Bioorg Med Chem Lett21:7399-404 (2011) 
 
Renin
Name:Renin
Type:Enzyme
Mol. Mass.:45058.99
Organism:Homo sapiens (Human)
Description:n/a
Residue:406
BDBM50359185
NameBDBM50359185
Synonyms:CHEMBL1923122
TypeSmall organic molecule
Emp. Form.C31H34F2N2O3
Mol. Mass.520.6101
SMILESCOCCCc1cccc2cccc(CN(C3CC3)C(=O)[C@H]3CNCC[C@@]33OCc4cc(F)c(F)cc34)c12