Reaction Details
TargetAppetite-regulating hormone
LigandBDBM50359237
Substrate/Competitorn/a
Meas. Tech.ChEMBL_790253 (CHEMBL1925646)
Ki 5±n/a nM
Citation Hoveyda, HRMarsault, EGagnon, RMathieu, APVézina, MLandry, AWang, ZBenakli, KBeaubien, SSaint-Louis, CBrassard, MPinault, JFOuellet, LBhat, SRamaseshan, MPeng, XFoucher, LBeauchemin, SBhérer, PVeber, DFPeterson, MLFraser, GL Optimization of the potency and pharmacokinetic properties of a macrocyclic ghrelin receptor agonist (Part I): Development of ulimorelin (TZP-101) from hit to clinic. J Med Chem54:8305-20 (2011) 
 
Appetite-regulating hormone
Name:Appetite-regulating hormone
Type:PROTEIN
Mol. Mass.:12908.57
Organism:Homo sapiens (Human)
Description:ChEMBL_790253
Residue:117
BDBM50359237
NameBDBM50359237
Synonyms:CHEMBL1923627
TypeSmall organic molecule
Emp. Form.C30H40N4O4
Mol. Mass.520.663
SMILESC[C@H]1N(C)C(=O)[C@@H](NCCOc2ccccc2CCCNC(=O)[C@@H](Cc2ccc(C)cc2)NC1=O)C1CC1