Reaction Details
TargetAppetite-regulating hormone
LigandBDBM50359252
Substrate/Competitorn/a
Meas. Tech.ChEMBL_790253 (CHEMBL1925646)
Ki 2.6±n/a nM
Citation Hoveyda, HRMarsault, EGagnon, RMathieu, APVézina, MLandry, AWang, ZBenakli, KBeaubien, SSaint-Louis, CBrassard, MPinault, JFOuellet, LBhat, SRamaseshan, MPeng, XFoucher, LBeauchemin, SBhérer, PVeber, DFPeterson, MLFraser, GL Optimization of the potency and pharmacokinetic properties of a macrocyclic ghrelin receptor agonist (Part I): Development of ulimorelin (TZP-101) from hit to clinic. J Med Chem54:8305-20 (2011) 
 
Appetite-regulating hormone
Name:Appetite-regulating hormone
Type:PROTEIN
Mol. Mass.:12908.57
Organism:Homo sapiens (Human)
Description:ChEMBL_790253
Residue:117
BDBM50359252
NameBDBM50359252
Synonyms:CHEMBL1923642
TypeSmall organic molecule
Emp. Form.C29H36F2N4O4
Mol. Mass.542.6173
SMILESC[C@H]1N(C)C(=O)[C@@H](NCCOc2cc(F)ccc2CCCNC(=O)[C@@H](Cc2ccc(F)cc2)NC1=O)C1CC1