Reaction Details
TargetAcetylcholinesterase
LigandBDBM50359288
Substrate/Competitorn/a
Meas. Tech.ChEMBL_794256 (CHEMBL1932081)
Ki 55400±n/a nM
Citation Zakhari, JSKinoyama, IHixon, MSDi Mola, AGlobisch, DJanda, KD Formulating a new basis for the treatment against botulinum neurotoxin intoxication: 3,4-Diaminopyridine prodrug design and characterization. Bioorg Med Chem19:6203-9 (2011) 
 
Acetylcholinesterase
Name:Acetylcholinesterase
Type:Enzyme
Mol. Mass.:71812.79
Organism:Electrophorus electricus (Electric eel)
Description:n/a
Residue:633
BDBM50359288
NameBDBM50359288
Synonyms:CHEMBL1928383
TypeSmall organic molecule
Emp. Form.C18H21N3O4
Mol. Mass.343.377
SMILESCC(C)CC(=O)Oc1ccc(COC(=O)Nc2ccncc2N)cc1