Reaction Details
TargetAcetylcholinesterase
LigandBDBM50359289
Substrate/Competitorn/a
Meas. Tech.ChEMBL_794256 (CHEMBL1932081)
Ki 6800±n/a nM
Citation Zakhari, JSKinoyama, IHixon, MSDi Mola, AGlobisch, DJanda, KD Formulating a new basis for the treatment against botulinum neurotoxin intoxication: 3,4-Diaminopyridine prodrug design and characterization. Bioorg Med Chem19:6203-9 (2011) 
 
Acetylcholinesterase
Name:Acetylcholinesterase
Type:Enzyme
Mol. Mass.:71812.79
Organism:Electrophorus electricus (Electric eel)
Description:n/a
Residue:633
BDBM50359289
NameBDBM50359289
Synonyms:CHEMBL1928384
TypeSmall organic molecule
Emp. Form.C19H21N3O4
Mol. Mass.355.3877
SMILESNc1cnccc1NC(=O)OCc1ccc(OC(=O)C2CCCC2)cc1