Reaction Details
TargetAcetylcholinesterase
LigandBDBM50359292
Substrate/Competitorn/a
Meas. Tech.ChEMBL_794256 (CHEMBL1932081)
Ki 32500±n/a nM
Citation Zakhari, JSKinoyama, IHixon, MSDi Mola, AGlobisch, DJanda, KD Formulating a new basis for the treatment against botulinum neurotoxin intoxication: 3,4-Diaminopyridine prodrug design and characterization. Bioorg Med Chem19:6203-9 (2011) 
 
Acetylcholinesterase
Name:Acetylcholinesterase
Type:Enzyme
Mol. Mass.:71812.79
Organism:Electrophorus electricus (Electric eel)
Description:n/a
Residue:633
BDBM50359292
NameBDBM50359292
Synonyms:CHEMBL1928393
TypeSmall organic molecule
Emp. Form.C7H9N3O
Mol. Mass.151.1659
SMILESCC(=O)Nc1ccncc1N