Reaction Details
TargetCarboxylic ester hydrolase
LigandBDBM50359284
Substrate/Competitorn/a
Meas. Tech.ChEMBL_794257 (CHEMBL1932082)
Ki 1600±n/a nM
Citation Zakhari, JSKinoyama, IHixon, MSDi Mola, AGlobisch, DJanda, KD Formulating a new basis for the treatment against botulinum neurotoxin intoxication: 3,4-Diaminopyridine prodrug design and characterization. Bioorg Med Chem19:6203-9 (2011) 
 
Carboxylic ester hydrolase
Name:Carboxylic ester hydrolase
Type:Protein
Mol. Mass.:68842.83
Organism:Equus caballus (Horse)
Description:Q9N1N9
Residue:602
BDBM50359284
NameBDBM50359284
Synonyms:CHEMBL1928379
TypeSmall organic molecule
Emp. Form.C15H15N3O4
Mol. Mass.301.2973
SMILESCC(=O)Oc1ccc(COC(=O)Nc2ccncc2N)cc1