Reaction Details
TargetMitogen-activated protein kinase 14
LigandBDBM50359316
Substrate/Competitorn/a
Meas. Tech.ChEMBL_794350 (CHEMBL1932272)
IC50 76±n/a nM
Citation Moffett, KKonteatis, ZNguyen, DShetty, RLudington, JFujimoto, TLee, KJChai, XNamboodiri, HKarpusas, MDorsey, BGuarnieri, FBukhtiyarova, MSpringman, EMichelotti, E Discovery of a novel class of non-ATP site DFG-out state p38 inhibitors utilizing computationally assisted virtual fragment-based drug design (vFBDD). Bioorg Med Chem Lett21:7155-65 (2011) 
 
Mitogen-activated protein kinase 14
Name:Mitogen-activated protein kinase 14
Type:Serine/threonine-protein kinase
Mol. Mass.:41286.76
Organism:Homo sapiens (Human)
Description:Q16539
Residue:360
BDBM50359316
NameBDBM50359316
Synonyms:CHEMBL1929195
TypeSmall organic molecule
Emp. Form.C24H27N3O4S2
Mol. Mass.485.619
SMILESCC(C)(C)c1cc(C(=O)N2CCS(=O)(=O)CC2)c(NC(=O)Nc2cccc3ccccc23)s1