Reaction Details
TargetMitogen-activated protein kinase 14
LigandBDBM50359324
Substrate/Competitorn/a
Meas. Tech.ChEMBL_794350 (CHEMBL1932272)
IC50 240±n/a nM
Citation Moffett, KKonteatis, ZNguyen, DShetty, RLudington, JFujimoto, TLee, KJChai, XNamboodiri, HKarpusas, MDorsey, BGuarnieri, FBukhtiyarova, MSpringman, EMichelotti, E Discovery of a novel class of non-ATP site DFG-out state p38 inhibitors utilizing computationally assisted virtual fragment-based drug design (vFBDD). Bioorg Med Chem Lett21:7155-65 (2011) 
 
Mitogen-activated protein kinase 14
Name:Mitogen-activated protein kinase 14
Type:Serine/threonine-protein kinase
Mol. Mass.:41286.76
Organism:Homo sapiens (Human)
Description:Q16539
Residue:360
BDBM50359324
NameBDBM50359324
Synonyms:CHEMBL1929203
TypeSmall organic molecule
Emp. Form.C20H24ClN3O4S2
Mol. Mass.470.005
SMILESCC(C)(C)c1cc(NC(=O)Nc2ccc(Cl)cc2)c(s1)C(=O)N1CCS(=O)(=O)CC1