Reaction Details
TargetTyrosine-protein kinase Fer
LigandBDBM50359359
Substrate/Competitorn/a
Meas. Tech.ChEMBL_793882 (CHEMBL1932855)
IC50>30000±n/a nM
Citation Moffett, KKonteatis, ZNguyen, DShetty, RLudington, JFujimoto, TLee, KJChai, XNamboodiri, HKarpusas, MDorsey, BGuarnieri, FBukhtiyarova, MSpringman, EMichelotti, E Discovery of a novel class of non-ATP site DFG-out state p38 inhibitors utilizing computationally assisted virtual fragment-based drug design (vFBDD). Bioorg Med Chem Lett21:7155-65 (2011) 
 
Tyrosine-protein kinase Fer
Name:Tyrosine-protein kinase Fer
Type:Enzyme
Mol. Mass.:94643.38
Organism:Homo sapiens (Human)
Description:P16591
Residue:822
BDBM50359359
NameBDBM50359359
Synonyms:CHEMBL1929238
TypeSmall organic molecule
Emp. Form.C25H33Cl2N5O3S
Mol. Mass.554.532
SMILESCN(C)CCN1CCN(CCC1=O)C(=O)c1cc(sc1NC(=O)Nc1cccc(Cl)c1Cl)C(C)(C)C