Reaction Details
TargetPolycystin-2
LigandBDBM50359359
Substrate/Competitorn/a
Meas. Tech.ChEMBL_793953 (CHEMBL1931545)
IC50>30000±n/a nM
Citation Moffett, KKonteatis, ZNguyen, DShetty, RLudington, JFujimoto, TLee, KJChai, XNamboodiri, HKarpusas, MDorsey, BGuarnieri, FBukhtiyarova, MSpringman, EMichelotti, E Discovery of a novel class of non-ATP site DFG-out state p38 inhibitors utilizing computationally assisted virtual fragment-based drug design (vFBDD). Bioorg Med Chem Lett21:7155-65 (2011) 
 
Polycystin-2
Name:Polycystin-2
Type:PROTEIN
Mol. Mass.:109676.85
Organism:Homo sapiens (Human)
Description:ChEMBL_886731
Residue:968
BDBM50359359
NameBDBM50359359
Synonyms:CHEMBL1929238
TypeSmall organic molecule
Emp. Form.C25H33Cl2N5O3S
Mol. Mass.554.532
SMILESCN(C)CCN1CCN(CCC1=O)C(=O)c1cc(sc1NC(=O)Nc1cccc(Cl)c1Cl)C(C)(C)C