Reaction Details
TargetCytochrome P450 2C9
LigandBDBM50359366
Substrate/Competitorn/a
Meas. Tech.ChEMBL_793119 (CHEMBL1932778)
IC50>10000±n/a nM
Citation Kato, NOka, MMurase, TYoshida, MSakairi, MYamashita, SYasuda, YYoshikawa, AHayashi, YMakino, MTakeda, MMirensha, YKakigami, T Discovery and pharmacological characterization of N-[2-({2-[(2S)-2-cyanopyrrolidin-1-yl]-2-oxoethyl}amino)-2-methylpropyl]-2-methylpyrazolo[1,5-a]pyrimidine-6-carboxamide hydrochloride (anagliptin hydrochloride salt) as a potent and selective DPP-IV inhibitor. Bioorg Med Chem19:7221-7 (2011) 
 
Cytochrome P450 2C9
Name:Cytochrome P450 2C9
Type:Enzyme
Mol. Mass.:55636.33
Organism:Homo sapiens (Human)
Description:P11712
Residue:490
BDBM50359366
NameBDBM50359366
Synonyms:CHEMBL1929387 | CHEMBL1929396
TypeSmall organic molecule
Emp. Form.C19H25N7O2
Mol. Mass.383.4475
SMILESCc1cc2ncc(cn2n1)C(=O)NCC(C)(C)NCC(=O)N1CCC[C@H]1C#N