Reaction Details
TargetAmine oxidase [flavin-containing] B
LigandBDBM50359391
Substrate/Competitorn/a
Meas. Tech.ChEMBL_793326 (CHEMBL1931829)
IC50 43±n/a nM
Citation Bolea, IJuárez-Jiménez, Jde Los Ríos, CChioua, MPouplana, RLuque, FJUnzeta, MMarco-Contelles, JSamadi, A Synthesis, biological evaluation, and molecular modeling of donepezil and N-[(5-(benzyloxy)-1-methyl-1H-indol-2-yl)methyl]-N-methylprop-2-yn-1-amine hybrids as new multipotent cholinesterase/monoamine oxidase inhibitors for the treatment of Alzheimer's disease. J Med Chem54:8251-70 (2011) 
 
Amine oxidase [flavin-containing] B
Name:Amine oxidase [flavin-containing] B
Type:Enzyme
Mol. Mass.:58469.65
Organism:Rattus norvegicus (rat)
Description:P19643
Residue:520
BDBM50359391
NameBDBM50359391
Synonyms:CHEMBL1929421
TypeSmall organic molecule
Emp. Form.C29H37N3O
Mol. Mass.443.6236
SMILESCN(CC#C)Cc1cc2cc(OCCCC3CCN(Cc4ccccc4)CC3)ccc2n1C