Reaction Details
TargetAmine oxidase [flavin-containing] A
LigandBDBM50359396
Substrate/Competitorn/a
Meas. Tech.ChEMBL_793325 (CHEMBL1931828)
IC50 6.7±n/a nM
Citation Bolea, IJuárez-Jiménez, Jde Los Ríos, CChioua, MPouplana, RLuque, FJUnzeta, MMarco-Contelles, JSamadi, A Synthesis, biological evaluation, and molecular modeling of donepezil and N-[(5-(benzyloxy)-1-methyl-1H-indol-2-yl)methyl]-N-methylprop-2-yn-1-amine hybrids as new multipotent cholinesterase/monoamine oxidase inhibitors for the treatment of Alzheimer's disease. J Med Chem54:8251-70 (2011) 
 
Amine oxidase [flavin-containing] A
Name:Amine oxidase [flavin-containing] A
Type:Enzyme
Mol. Mass.:59515.21
Organism:Rattus norvegicus (rat)
Description:n/a
Residue:526
BDBM50359396
NameBDBM50359396
Synonyms:CHEMBL1929420 | US8999994, 5
TypeSmall organic molecule
Emp. Form.C28H35N3O
Mol. Mass.429.597
SMILESCN(CC#C)Cc1cc2cc(OCCC3CCN(Cc4ccccc4)CC3)ccc2n1C